Reaction Details
TargetDual specificity protein kinase TTK
LigandBDBM50386836
Substrate/Competitorn/a
Meas. Tech.ChEMBL_828454 (CHEMBL2049891)
IC50 3±n/a nM
Citation Vijay Kumar, DHoarau, CBursavich, MSlattum, PGerrish, DYager, KSaunders, MShenderovich, MRoth, BLMcKinnon, RChan, ACimbora, DMBradford, CReeves, LPatton, SPapac, DIWilliams, BLCarlson, RO Lead optimization of purine based orally bioavailable Mps1 (TTK) inhibitors. Bioorg Med Chem Lett22:4377-85 (2012) 
 
Dual specificity protein kinase TTK
Name:Dual specificity protein kinase TTK
Type:Protein
Mol. Mass.:97086.79
Organism:Homo sapiens (Human)
Description:P33981
Residue:857
BDBM50386836
NameBDBM50386836
Synonyms:CHEMBL2047964
TypeSmall organic molecule
Emp. Form.C28H33N9O2
Mol. Mass.527.6207
SMILESCOc1cc(ccc1Nc1nc(NC2CCCCC2)c2[nH]cnc2n1)N1CCN(CC1)C(=O)c1ccccn1