Reaction Details
TargetGrowth hormone secretagogue receptor type 1
LigandBDBM50386942
Substrate/Competitorn/a
Meas. Tech.ChEMBL_827492 (CHEMBL2051349)
Ki 408±n/a nM
Citation Kung, DWCoffey, SBJones, RMCabral, SJiao, WFichtner, MCarpino, PARose, CRHank, RFLopaze, MGSwartz, RChen, HTHendsch, ZPosner, BWielis, CFManning, BDubins, JStock, IAVarma, SCampbell, MDeBartola, DKosa-Maines, RSteyn, SJMcClure, KF Identification of spirocyclic piperidine-azetidine inverse agonists of the ghrelin receptor. Bioorg Med Chem Lett22:4281-7 (2012) 
 
Growth hormone secretagogue receptor type 1
Name:Growth hormone secretagogue receptor type 1
Type:Receptor
Mol. Mass.:41334.57
Organism:Homo sapiens (Human)
Description:Receptor binding studies use plasma membranes from LLC PK-1 cells transiently transfected with hGHSR1a.
Residue:366
BDBM50386942
NameBDBM50386942
Synonyms:CHEMBL2048807
TypeSmall organic molecule
Emp. Form.C28H36N2O4
Mol. Mass.464.5964
SMILESCOc1ccc(OCC(=O)N2CCC3(CN(Cc4ccc5OC(C)(C)CCc5c4)C3)CC2)cc1