Reaction Details
TargetGrowth hormone secretagogue receptor type 1
LigandBDBM50386945
Substrate/Competitorn/a
Meas. Tech.ChEMBL_827492 (CHEMBL2051349)
Ki 20±n/a nM
Citation Kung, DWCoffey, SBJones, RMCabral, SJiao, WFichtner, MCarpino, PARose, CRHank, RFLopaze, MGSwartz, RChen, HTHendsch, ZPosner, BWielis, CFManning, BDubins, JStock, IAVarma, SCampbell, MDeBartola, DKosa-Maines, RSteyn, SJMcClure, KF Identification of spirocyclic piperidine-azetidine inverse agonists of the ghrelin receptor. Bioorg Med Chem Lett22:4281-7 (2012) 
 
Growth hormone secretagogue receptor type 1
Name:Growth hormone secretagogue receptor type 1
Type:Receptor
Mol. Mass.:41334.57
Organism:Homo sapiens (Human)
Description:Receptor binding studies use plasma membranes from LLC PK-1 cells transiently transfected with hGHSR1a.
Residue:366
BDBM50386945
NameBDBM50386945
Synonyms:CHEMBL2048810
TypeSmall organic molecule
Emp. Form.C27H35ClN2O4
Mol. Mass.487.031
SMILESCOc1ccc(OCC(=O)N2CCC3(CN(Cc4ccc(OCC(C)C)cc4Cl)C3)CC2)cc1