Reaction Details
TargetPhospho-N-acetylmuramoyl-pentapeptide-transferase
LigandBDBM50386966
Substrate/Competitorn/a
Meas. Tech.ChEMBL_827497 (CHEMBL2051354)
IC50 650±n/a nM
Citation Okamoto, KSakagami, MFeng, FTakahashi, FUotani, KTogame, HTakemoto, HIchikawa, SMatsuda, A Synthesis of pacidamycin analogues via an Ugi-multicomponent reaction. Bioorg Med Chem Lett22:4810-5 (2012) 
 
Phospho-N-acetylmuramoyl-pentapeptide-transferase
Name:Phospho-N-acetylmuramoyl-pentapeptide-transferase
Type:PROTEIN
Mol. Mass.:35238.55
Organism:Staphylococcus aureus (strain MRSA252)
Description:ChEMBL_827497
Residue:321
BDBM50386966
NameBDBM50386966
Synonyms:CHEMBL2048831
TypeSmall organic molecule
Emp. Form.C40H48N10O13
Mol. Mass.876.8683
SMILESC[C@H](NC(=O)N[C@@H](Cc1c[nH]c2ccccc12)C(O)=O)C(=O)N[C@H]([C@H](C)N(C)C(=O)[C@H](Cc1cccc(O)c1)NC(=O)CN)C(=O)N\C=C1/O[C@H]([C@H](O)[C@@H]1O)n1ccc(=O)[nH]c1=O