Reaction Details
TargetHepatocyte growth factor receptor
LigandBDBM50359981
Substrate/Competitorn/a
Meas. Tech.ChEMBL_828151 (CHEMBL2049981)
IC50 200±n/a nM
Citation Colombo, FTintori, CFurlan, ABorrelli, SChristodoulou, MSDono, RMaina, FBotta, MAmat, MBosch, JPassarella, D 'Click' synthesis of a triazole-based inhibitor of Met functions in cancer cells. Bioorg Med Chem Lett22:4693-6 (2012) 
 
Hepatocyte growth factor receptor
Name:Hepatocyte growth factor receptor
Type:PROTEIN
Mol. Mass.:154649.32
Organism:Canis familiaris
Description:ChEMBL_828151
Residue:1382
BDBM50359981
NameBDBM50359981
Synonyms:CHEMBL1927770
TypeSmall organic molecule
Emp. Form.C34H24F6N4O2S
Mol. Mass.666.635
SMILESFC(F)(F)c1cc(CC(=O)N[C@@H](Cc2ccccc2)C(=O)Nc2ccc(cc2)-c2cn3c(n2)sc2ccccc32)cc(c1)C(F)(F)F