Reaction Details
TargetVesicular acetylcholine transporter
LigandBDBM50039613
Substrate/Competitorn/a
Meas. Tech.ChEMBL_828208 (CHEMBL2050140)
Ki 0.055±n/a nM
Citation Tu, ZWang, WCui, JZhang, XLu, XXu, JParsons, SM Synthesis and evaluation of in vitro bioactivity for vesicular acetylcholine transporter inhibitors containing two carbonyl groups. Bioorg Med Chem20:4422-9 (2012) 
 
Vesicular acetylcholine transporter
Name:Vesicular acetylcholine transporter
Type:PROTEIN
Mol. Mass.:56900.67
Organism:Homo sapiens (Human)
Description:ChEMBL_1507628
Residue:532
BDBM50039613
NameBDBM50039613
Synonyms:(2R,3R)-3-(4-Phenyl-piperidin-1-yl)-1,2,3,4-tetrahydro-naphthalen-2-ol CHEMBL87379 | trans-3-(4-phenylpiperidin-1-yl)-1,2,3,4-tetrahydronaphthalen-2-ol
TypeSmall organic molecule
Emp. Form.C21H25NO
Mol. Mass.307.4293
SMILESO[C@@H]1Cc2ccccc2C[C@H]1N1CCC(CC1)c1ccccc1