Reaction Details
TargetBifunctional dihydrofolate reductase-thymidylate synthase
LigandBDBM50387407
Substrate/Competitorn/a
Meas. Tech.ChEMBL_828288 (CHEMBL2050307)
IC50>13000±n/a nM
Citation Gangjee, AZhao, YIhnat, MAThorpe, JEBailey-Downs, LCKisliuk, RL Novel tricyclic indeno[2,1-d]pyrimidines with dual antiangiogenic and cytotoxic activities as potent antitumor agents. Bioorg Med Chem20:4217-25 (2012) 
 
Bifunctional dihydrofolate reductase-thymidylate synthase
Name:Bifunctional dihydrofolate reductase-thymidylate synthase
Type:Enzyme
Mol. Mass.:68757.49
Organism:Toxoplasma gondii
Description:Q07422
Residue:610
BDBM50387407
NameBDBM50387407
Synonyms:CHEMBL2047253
TypeSmall organic molecule
Emp. Form.C17H12ClFN4
Mol. Mass.326.755
SMILESNc1nc2cc3ccccc3c2c(Nc2ccc(Cl)cc2F)[nH]1