Reaction Details
TargetPlatelet-derived growth factor receptor beta
LigandBDBM50387407
Substrate/Competitorn/a
Meas. Tech.ChEMBL_828213 (CHEMBL2050145)
IC50 3600±n/a nM
Citation Gangjee, AZhao, YIhnat, MAThorpe, JEBailey-Downs, LCKisliuk, RL Novel tricyclic indeno[2,1-d]pyrimidines with dual antiangiogenic and cytotoxic activities as potent antitumor agents. Bioorg Med Chem20:4217-25 (2012) 
 
Platelet-derived growth factor receptor beta
Name:Platelet-derived growth factor receptor beta
Type:Enzyme
Mol. Mass.:123922.25
Organism:Homo sapiens (Human)
Description:P09619
Residue:1106
BDBM50387407
NameBDBM50387407
Synonyms:CHEMBL2047253
TypeSmall organic molecule
Emp. Form.C17H12ClFN4
Mol. Mass.326.755
SMILESNc1nc2cc3ccccc3c2c(Nc2ccc(Cl)cc2F)[nH]1