Reaction Details
TargetPlatelet-derived growth factor receptor beta
LigandBDBM50387411
Substrate/Competitorn/a
Meas. Tech.ChEMBL_828213 (CHEMBL2050145)
IC50 75500±n/a nM
Citation Gangjee, AZhao, YIhnat, MAThorpe, JEBailey-Downs, LCKisliuk, RL Novel tricyclic indeno[2,1-d]pyrimidines with dual antiangiogenic and cytotoxic activities as potent antitumor agents. Bioorg Med Chem20:4217-25 (2012) 
 
Platelet-derived growth factor receptor beta
Name:Platelet-derived growth factor receptor beta
Type:Enzyme
Mol. Mass.:123922.25
Organism:Homo sapiens (Human)
Description:P09619
Residue:1106
BDBM50387411
NameBDBM50387411
Synonyms:CHEMBL2047251
TypeSmall organic molecule
Emp. Form.C18H16N4O
Mol. Mass.304.3458
SMILESCOc1cccc(Nc2[nH]c(N)nc3cc4ccccc4c23)c1