Reaction Details
TargetPlatelet-derived growth factor receptor beta
LigandBDBM50387415
Substrate/Competitorn/a
Meas. Tech.ChEMBL_828213 (CHEMBL2050145)
IC50 126300±n/a nM
Citation Gangjee, AZhao, YIhnat, MAThorpe, JEBailey-Downs, LCKisliuk, RL Novel tricyclic indeno[2,1-d]pyrimidines with dual antiangiogenic and cytotoxic activities as potent antitumor agents. Bioorg Med Chem20:4217-25 (2012) 
 
Platelet-derived growth factor receptor beta
Name:Platelet-derived growth factor receptor beta
Type:Enzyme
Mol. Mass.:123922.25
Organism:Homo sapiens (Human)
Description:P09619
Residue:1106
BDBM50387415
NameBDBM50387415
Synonyms:CHEMBL2047248
TypeSmall organic molecule
Emp. Form.C17H13BrN4
Mol. Mass.353.216
SMILESNc1nc2cc3ccccc3c2c(Nc2cccc(Br)c2)[nH]1