Reaction Details
TargetVascular endothelial growth factor receptor 2
LigandBDBM50387418
Substrate/Competitorn/a
Meas. Tech.ChEMBL_828212 (CHEMBL2050144)
IC50 11000±n/a nM
Citation Gangjee, AZhao, YIhnat, MAThorpe, JEBailey-Downs, LCKisliuk, RL Novel tricyclic indeno[2,1-d]pyrimidines with dual antiangiogenic and cytotoxic activities as potent antitumor agents. Bioorg Med Chem20:4217-25 (2012) 
 
Vascular endothelial growth factor receptor 2
Name:Vascular endothelial growth factor receptor 2
Type:Receptor Tyrosine Kinase
Mol. Mass.:151510.97
Organism:Homo sapiens (Human)
Description:P35968
Residue:1356
BDBM50387418
NameBDBM50387418
Synonyms:CHEMBL2047245
TypeSmall organic molecule
Emp. Form.C20H20N4
Mol. Mass.316.3996
SMILESCC(C)c1ccc(Nc2[nH]c(N)nc3cc4ccccc4c23)cc1