Reaction Details
TargetEpidermal growth factor receptor
LigandBDBM50387414
Substrate/Competitorn/a
Meas. Tech.ChEMBL_828211 (CHEMBL2050143)
IC50>300000±n/a nM
Citation Gangjee, AZhao, YIhnat, MAThorpe, JEBailey-Downs, LCKisliuk, RL Novel tricyclic indeno[2,1-d]pyrimidines with dual antiangiogenic and cytotoxic activities as potent antitumor agents. Bioorg Med Chem20:4217-25 (2012) 
 
Epidermal growth factor receptor
Name:Epidermal growth factor receptor
Type:Receptor Kinase Domain
Mol. Mass.:134279.59
Organism:Homo sapiens (Human)
Description:P00533
Residue:1210
BDBM50387414
NameBDBM50387414
Synonyms:CHEMBL2047249
TypeSmall organic molecule
Emp. Form.C17H13BrN4
Mol. Mass.353.216
SMILESNc1nc2cc3ccccc3c2c(Nc2ccc(Br)cc2)[nH]1