Reaction Details
TargetBifunctional dihydrofolate reductase-thymidylate synthase
LigandBDBM18795
Substrate/Competitorn/a
Meas. Tech.ChEMBL_828288 (CHEMBL2050307)
IC50 480±n/a nM
Citation Gangjee, AZhao, YIhnat, MAThorpe, JEBailey-Downs, LCKisliuk, RL Novel tricyclic indeno[2,1-d]pyrimidines with dual antiangiogenic and cytotoxic activities as potent antitumor agents. Bioorg Med Chem20:4217-25 (2012) 
 
Bifunctional dihydrofolate reductase-thymidylate synthase
Name:Bifunctional dihydrofolate reductase-thymidylate synthase
Type:Enzyme
Mol. Mass.:68757.49
Organism:Toxoplasma gondii
Description:Q07422
Residue:610
BDBM18795
NameBDBM18795
Synonyms:(2S)-2-[(5-{methyl[(2-methyl-4-oxo-1,4-dihydroquinazolin-6-yl)methyl]amino}thiophen-2-yl)formamido]pentanedioic acid RTX Tomudex | ZD1694
TypeSmall organic molecule
Emp. Form.C21H22N4O6S
Mol. Mass.458.488
SMILESCN(Cc1ccc2nc(C)[nH]c(=O)c2c1)c1ccc(s1)C(=O)N[C@@H](CCC(O)=O)C(O)=O