Reaction Details
TargetDihydrofolate reductase
LigandBDBM50387418
Substrate/Competitorn/a
Meas. Tech.ChEMBL_828283 (CHEMBL2050302)
IC50>16000±n/a nM
Citation Gangjee, AZhao, YIhnat, MAThorpe, JEBailey-Downs, LCKisliuk, RL Novel tricyclic indeno[2,1-d]pyrimidines with dual antiangiogenic and cytotoxic activities as potent antitumor agents. Bioorg Med Chem20:4217-25 (2012) 
 
Dihydrofolate reductase
Name:Dihydrofolate reductase
Type:Enzyme
Mol. Mass.:21453.99
Organism:Homo sapiens (Human)
Description:Recombinant human DHFR.
Residue:187
BDBM50387418
NameBDBM50387418
Synonyms:CHEMBL2047245
TypeSmall organic molecule
Emp. Form.C20H20N4
Mol. Mass.316.3996
SMILESCC(C)c1ccc(Nc2[nH]c(N)nc3cc4ccccc4c23)cc1