Reaction Details
TargetEpidermal growth factor receptor
LigandBDBM50387407
Substrate/Competitorn/a
Meas. Tech.ChEMBL_828211 (CHEMBL2050143)
IC50 11700±n/a nM
Citation Gangjee, AZhao, YIhnat, MAThorpe, JEBailey-Downs, LCKisliuk, RL Novel tricyclic indeno[2,1-d]pyrimidines with dual antiangiogenic and cytotoxic activities as potent antitumor agents. Bioorg Med Chem20:4217-25 (2012) 
 
Epidermal growth factor receptor
Name:Epidermal growth factor receptor
Type:Receptor Kinase Domain
Mol. Mass.:134279.59
Organism:Homo sapiens (Human)
Description:P00533
Residue:1210
BDBM50387407
NameBDBM50387407
Synonyms:CHEMBL2047253
TypeSmall organic molecule
Emp. Form.C17H12ClFN4
Mol. Mass.326.755
SMILESNc1nc2cc3ccccc3c2c(Nc2ccc(Cl)cc2F)[nH]1