Reaction Details
TargetEpidermal growth factor receptor
LigandBDBM50387419
Substrate/Competitorn/a
Meas. Tech.ChEMBL_828211 (CHEMBL2050143)
IC50>200000±n/a nM
Citation Gangjee, AZhao, YIhnat, MAThorpe, JEBailey-Downs, LCKisliuk, RL Novel tricyclic indeno[2,1-d]pyrimidines with dual antiangiogenic and cytotoxic activities as potent antitumor agents. Bioorg Med Chem20:4217-25 (2012) 
 
Epidermal growth factor receptor
Name:Epidermal growth factor receptor
Type:Receptor Kinase Domain
Mol. Mass.:134279.59
Organism:Homo sapiens (Human)
Description:P00533
Residue:1210
BDBM50387419
NameBDBM50387419
Synonyms:CHEMBL2047244
TypeSmall organic molecule
Emp. Form.C20H20N4
Mol. Mass.316.3996
SMILESCC(C)c1ccccc1Nc1[nH]c(N)nc2cc3ccccc3c12