Reaction Details
TargetCalcitonin gene-related peptide type 1 receptor
LigandBDBM50387494
Substrate/Competitorn/a
Meas. Tech.ChEMBL_830172 (CHEMBL2061982)
Ki 1400±n/a nM
Citation Han, XCiviello, RLConway, CMCook, DADavis, CDMacci, RPin, SSRen, SXSchartman, RSignor, LJThalody, GWidmann, KAXu, CChaturvedula, PVMacor, JEDubowchik, GM The synthesis and SAR of calcitonin gene-related peptide (CGRP) receptor antagonists derived from tyrosine surrogates. Part 1. Bioorg Med Chem Lett22:4723-7 (2012) 
 
Calcitonin gene-related peptide type 1 receptor
Name:Calcitonin gene-related peptide type 1 receptor
Type:Enzyme Catalytic Domain
Mol. Mass.:52980.45
Organism:Homo sapiens (Human)
Description:Q16602
Residue:461
BDBM50387494
NameBDBM50387494
Synonyms:CHEMBL2059793
TypeSmall organic molecule
Emp. Form.C33H44N6O4
Mol. Mass.588.7403
SMILESCOc1ccc(C[C@@H](NC(=O)N2CCC(CC2)n2c3ccccc3[nH]c2=O)C(=O)N2CCC(CC2)N2CCCCC2)cc1