Reaction Details
TargetCalcitonin gene-related peptide type 1 receptor
LigandBDBM50387510
Substrate/Competitorn/a
Meas. Tech.ChEMBL_830172 (CHEMBL2061982)
Ki 0.55±n/a nM
Citation Han, XCiviello, RLConway, CMCook, DADavis, CDMacci, RPin, SSRen, SXSchartman, RSignor, LJThalody, GWidmann, KAXu, CChaturvedula, PVMacor, JEDubowchik, GM The synthesis and SAR of calcitonin gene-related peptide (CGRP) receptor antagonists derived from tyrosine surrogates. Part 1. Bioorg Med Chem Lett22:4723-7 (2012) 
 
Calcitonin gene-related peptide type 1 receptor
Name:Calcitonin gene-related peptide type 1 receptor
Type:Enzyme Catalytic Domain
Mol. Mass.:52980.45
Organism:Homo sapiens (Human)
Description:Q16602
Residue:461
BDBM50387510
NameBDBM50387510
Synonyms:CHEMBL2059878
TypeSmall organic molecule
Emp. Form.C33H43N9O3
Mol. Mass.613.753
SMILESO=C(N[C@H](Cc1ccc2nn[nH]c2c1)C(=O)N1CCC(CC1)N1CCCCC1)N1CCC(CC1)N1Cc2ccccc2NC1=O