Reaction Details
TargetMu-type opioid receptor
LigandBDBM50387550
Substrate/Competitorn/a
Meas. Tech.ChEMBL_830314 (CHEMBL2060903)
Ki>100000±n/a nM
Citation Nagase, HImaide, SHirayama, SNemoto, TFujii, H Essential structure of opioid¿ receptor agonist nalfurafine for binding to the¿ receptor 2: synthesis of decahydro(iminoethano)phenanthrene derivatives and their pharmacologies. Bioorg Med Chem Lett22:5071-4 (2012) 
 
Mu-type opioid receptor
Name:Mu-type opioid receptor
Type:Enzyme Catalytic Domain
Mol. Mass.:44431.62
Organism:MOUSE
Description:OPIATE Mu OPRM1 MOUSE::P42866
Residue:398
BDBM50387550
NameBDBM50387550
Synonyms:CHEMBL2057688
TypeSmall organic molecule
Emp. Form.C21H30N2O2
Mol. Mass.342.4751
SMILESCN([C@@H]1CC[C@H]2CN(CC3CC3)CC[C@@H]2C1)C(=O)\C=C\c1ccoc1