Reaction Details
TargetMu-type opioid receptor
LigandBDBM50387551
Substrate/Competitorn/a
Meas. Tech.ChEMBL_830314 (CHEMBL2060903)
Ki 391±n/a nM
Citation Nagase, HImaide, SHirayama, SNemoto, TFujii, H Essential structure of opioid¿ receptor agonist nalfurafine for binding to the¿ receptor 2: synthesis of decahydro(iminoethano)phenanthrene derivatives and their pharmacologies. Bioorg Med Chem Lett22:5071-4 (2012) 
 
Mu-type opioid receptor
Name:Mu-type opioid receptor
Type:Enzyme Catalytic Domain
Mol. Mass.:44431.62
Organism:MOUSE
Description:OPIATE Mu OPRM1 MOUSE::P42866
Residue:398
BDBM50387551
NameBDBM50387551
Synonyms:CHEMBL2057689
TypeSmall organic molecule
Emp. Form.C20H29NO2
Mol. Mass.315.4498
SMILESO[C@@]12CCC(=O)C[C@@]11CCN(CC3CC3)[C@@H]2CC2=C1CCCC2