Reaction Details
TargetDelta-type opioid receptor
LigandBDBM50387553
Substrate/Competitorn/a
Meas. Tech.ChEMBL_830315 (CHEMBL2060904)
Ki 308±n/a nM
Citation Nagase, HImaide, SHirayama, SNemoto, TFujii, H Essential structure of opioid¿ receptor agonist nalfurafine for binding to the¿ receptor 2: synthesis of decahydro(iminoethano)phenanthrene derivatives and their pharmacologies. Bioorg Med Chem Lett22:5071-4 (2012) 
 
Delta-type opioid receptor
Name:Delta-type opioid receptor
Type:Enzyme Catalytic Domain
Mol. Mass.:40577.25
Organism:MOUSE
Description:P32300
Residue:372
BDBM50387553
NameBDBM50387553
Synonyms:CHEMBL2057691
TypeSmall organic molecule
Emp. Form.C28H38N2O3
Mol. Mass.450.6129
SMILESCN([C@@H]1CC[C@@]2(O)[C@H]3CC4=C(CCCC4)[C@@]2(CCN3CC2CC2)C1)C(=O)\C=C\c1ccoc1