Reaction Details
TargetDelta-type opioid receptor
LigandBDBM50387554
Substrate/Competitorn/a
Meas. Tech.ChEMBL_830315 (CHEMBL2060904)
Ki 204±n/a nM
Citation Nagase, HImaide, SHirayama, SNemoto, TFujii, H Essential structure of opioid¿ receptor agonist nalfurafine for binding to the¿ receptor 2: synthesis of decahydro(iminoethano)phenanthrene derivatives and their pharmacologies. Bioorg Med Chem Lett22:5071-4 (2012) 
 
Delta-type opioid receptor
Name:Delta-type opioid receptor
Type:Enzyme Catalytic Domain
Mol. Mass.:40577.25
Organism:MOUSE
Description:P32300
Residue:372
BDBM50387554
NameBDBM50387554
Synonyms:CHEMBL2057692
TypeSmall organic molecule
Emp. Form.C28H38N2O2
Mol. Mass.434.6135
SMILESCN([C@@H]1CC[C@H]2[C@H]3CC4=C(CCCC4)[C@@]2(CCN3CC2CC2)C1)C(=O)\C=C\c1ccoc1