Reaction Details
TargetDelta-type opioid receptor
LigandBDBM50387549
Substrate/Competitorn/a
Meas. Tech.ChEMBL_830315 (CHEMBL2060904)
Ki 2.09±n/a nM
Citation Nagase, HImaide, SHirayama, SNemoto, TFujii, H Essential structure of opioid¿ receptor agonist nalfurafine for binding to the¿ receptor 2: synthesis of decahydro(iminoethano)phenanthrene derivatives and their pharmacologies. Bioorg Med Chem Lett22:5071-4 (2012) 
 
Delta-type opioid receptor
Name:Delta-type opioid receptor
Type:Enzyme Catalytic Domain
Mol. Mass.:40577.25
Organism:MOUSE
Description:P32300
Residue:372
BDBM50387549
NameBDBM50387549
Synonyms:CHEMBL2057693
TypeSmall organic molecule
Emp. Form.C28H34N2O4
Mol. Mass.462.5806
SMILESCN([C@@H]1CC[C@@]2(O)[C@H]3Cc4ccc(O)cc4[C@@]2(CCN3CC2CC2)C1)C(=O)\C=C\c1ccoc1