Reaction Details
TargetDelta-type opioid receptor
LigandBDBM50274519
Substrate/Competitorn/a
Meas. Tech.ChEMBL_830315 (CHEMBL2060904)
Ki 8.82±n/a nM
Citation Nagase, HImaide, SHirayama, SNemoto, TFujii, H Essential structure of opioid¿ receptor agonist nalfurafine for binding to the¿ receptor 2: synthesis of decahydro(iminoethano)phenanthrene derivatives and their pharmacologies. Bioorg Med Chem Lett22:5071-4 (2012) 
 
Delta-type opioid receptor
Name:Delta-type opioid receptor
Type:Enzyme Catalytic Domain
Mol. Mass.:40577.25
Organism:MOUSE
Description:P32300
Residue:372
BDBM50274519
NameBDBM50274519
Synonyms:(2E)-N-[(5R,6R)-17-(Cyclopropylmethyl)-4,5-epoxy-3-hydroxymorphinan-6-yl]-3-(furan-3-yl)-N-methylprop-2-enamide | CHEMBL483566
TypeSmall organic molecule
Emp. Form.C28H32N2O4
Mol. Mass.460.5647
SMILESCN([C@@H]1CC[C@H]2[C@H]3Cc4ccc(O)c5O[C@@H]1[C@]2(CCN3CC1CC1)c45)C(=O)\C=C\c1ccoc1