Reaction Details
TargetKappa-type opioid receptor
LigandBDBM50387551
Substrate/Competitorn/a
Meas. Tech.ChEMBL_830316 (CHEMBL2060905)
Ki 787±n/a nM
Citation Nagase, HImaide, SHirayama, SNemoto, TFujii, H Essential structure of opioid¿ receptor agonist nalfurafine for binding to the¿ receptor 2: synthesis of decahydro(iminoethano)phenanthrene derivatives and their pharmacologies. Bioorg Med Chem Lett22:5071-4 (2012) 
 
Kappa-type opioid receptor
Name:Kappa-type opioid receptor
Type:G Protein-Coupled Receptor (GPCR)
Mol. Mass.:42744.99
Organism:Cavia porcellus (domestic guinea pig)
Description:P41144
Residue:380
BDBM50387551
NameBDBM50387551
Synonyms:CHEMBL2057689
TypeSmall organic molecule
Emp. Form.C20H29NO2
Mol. Mass.315.4498
SMILESO[C@@]12CCC(=O)C[C@@]11CCN(CC3CC3)[C@@H]2CC2=C1CCCC2