Reaction Details
TargetKappa-type opioid receptor
LigandBDBM50387552
Substrate/Competitorn/a
Meas. Tech.ChEMBL_830316 (CHEMBL2060905)
Ki 352±n/a nM
Citation Nagase, HImaide, SHirayama, SNemoto, TFujii, H Essential structure of opioid¿ receptor agonist nalfurafine for binding to the¿ receptor 2: synthesis of decahydro(iminoethano)phenanthrene derivatives and their pharmacologies. Bioorg Med Chem Lett22:5071-4 (2012) 
 
Kappa-type opioid receptor
Name:Kappa-type opioid receptor
Type:G Protein-Coupled Receptor (GPCR)
Mol. Mass.:42744.99
Organism:Cavia porcellus (domestic guinea pig)
Description:P41144
Residue:380
BDBM50387552
NameBDBM50387552
Synonyms:CHEMBL2057690
TypeSmall organic molecule
Emp. Form.C21H34N2O
Mol. Mass.330.5075
SMILESCN[C@@H]1CC[C@@]2(O)[C@H]3CC4=C(CCCC4)[C@@]2(CCN3CC2CC2)C1