Reaction Details
TargetKappa-type opioid receptor
LigandBDBM50387554
Substrate/Competitorn/a
Meas. Tech.ChEMBL_830316 (CHEMBL2060905)
Ki 12.7±n/a nM
Citation Nagase, HImaide, SHirayama, SNemoto, TFujii, H Essential structure of opioid¿ receptor agonist nalfurafine for binding to the¿ receptor 2: synthesis of decahydro(iminoethano)phenanthrene derivatives and their pharmacologies. Bioorg Med Chem Lett22:5071-4 (2012) 
 
Kappa-type opioid receptor
Name:Kappa-type opioid receptor
Type:G Protein-Coupled Receptor (GPCR)
Mol. Mass.:42744.99
Organism:Cavia porcellus (domestic guinea pig)
Description:P41144
Residue:380
BDBM50387554
NameBDBM50387554
Synonyms:CHEMBL2057692
TypeSmall organic molecule
Emp. Form.C28H38N2O2
Mol. Mass.434.6135
SMILESCN([C@@H]1CC[C@H]2[C@H]3CC4=C(CCCC4)[C@@]2(CCN3CC2CC2)C1)C(=O)\C=C\c1ccoc1