Reaction Details
TargetKappa-type opioid receptor
LigandBDBM50274482
Substrate/Competitorn/a
Meas. Tech.ChEMBL_830316 (CHEMBL2060905)
Ki 2.82±n/a nM
Citation Nagase, HImaide, SHirayama, SNemoto, TFujii, H Essential structure of opioid¿ receptor agonist nalfurafine for binding to the¿ receptor 2: synthesis of decahydro(iminoethano)phenanthrene derivatives and their pharmacologies. Bioorg Med Chem Lett22:5071-4 (2012) 
 
Kappa-type opioid receptor
Name:Kappa-type opioid receptor
Type:G Protein-Coupled Receptor (GPCR)
Mol. Mass.:42744.99
Organism:Cavia porcellus (domestic guinea pig)
Description:P41144
Residue:380
BDBM50274482
NameBDBM50274482
Synonyms:(2E)-N-[(5R,6R)-17-(Cyclopropylmethyl)-4,5-epoxy-14-hydroxymorphinan-6-yl]-3-(furan-3-yl)-N-methylprop-2-enamide | CHEMBL485583
TypeSmall organic molecule
Emp. Form.C28H32N2O4
Mol. Mass.460.5647
SMILESCN([C@@H]1CC[C@@]2(O)[C@H]3Cc4cccc5O[C@@H]1[C@]2(CCN3CC1CC1)c45)C(=O)\C=C\c1ccoc1