Reaction Details
TargetCannabinoid receptor 2
LigandBDBM50387878
Substrate/Competitorn/a
Meas. Tech.ChEMBL_828930 (CHEMBL2060580)
EC50 44.4±n/a nM
Citation Hollinshead, SPAstles, PCChambers, MGJohnson, MPPalmer, JTidwell, MW Discovery and optimization of novel purines as potent and selective CB2 agonists. Bioorg Med Chem Lett22:4962-6 (2012) 
 
Cannabinoid receptor 2
Name:Cannabinoid receptor 2
Type:G Protein-Coupled Receptor (GPCR)
Mol. Mass.:39690.94
Organism:Homo sapiens (Human)
Description:P34972
Residue:360
BDBM50387878
NameBDBM50387878
Synonyms:CHEMBL1320425
TypeSmall organic molecule
Emp. Form.C18H20N4S
Mol. Mass.324.443
SMILESCN1CCN(CC1)c1nc(C)nc2sc(cc12)-c1ccccc1