Reaction Details
TargetCannabinoid receptor 1
LigandBDBM50387884
Substrate/Competitorn/a
Meas. Tech.ChEMBL_828933 (CHEMBL2060583)
EC50>100000±n/a nM
Citation Hollinshead, SPAstles, PCChambers, MGJohnson, MPPalmer, JTidwell, MW Discovery and optimization of novel purines as potent and selective CB2 agonists. Bioorg Med Chem Lett22:4962-6 (2012) 
 
Cannabinoid receptor 1
Name:Cannabinoid receptor 1
Type:G Protein-Coupled Receptor (GPCR)
Mol. Mass.:52868.96
Organism:Homo sapiens (Human)
Description:P21554
Residue:472
BDBM50387884
NameBDBM50387884
Synonyms:CHEMBL2057803
TypeSmall organic molecule
Emp. Form.C21H25ClN6O
Mol. Mass.412.916
SMILESCN1CCN(CC1)c1nc(C)nc2n([C@@H]3CCOC3)c(nc12)-c1ccccc1Cl