Reaction Details
TargetCannabinoid receptor 2
LigandBDBM50387884
Substrate/Competitorn/a
Meas. Tech.ChEMBL_828972 (CHEMBL2060622)
Ki 24±n/a nM
Citation Hollinshead, SPAstles, PCChambers, MGJohnson, MPPalmer, JTidwell, MW Discovery and optimization of novel purines as potent and selective CB2 agonists. Bioorg Med Chem Lett22:4962-6 (2012) 
 
Cannabinoid receptor 2
Name:Cannabinoid receptor 2
Type:Enzyme
Mol. Mass.:39366.68
Organism:Rattus norvegicus (Rat)
Description:Q9QZN9
Residue:360
BDBM50387884
NameBDBM50387884
Synonyms:CHEMBL2057803
TypeSmall organic molecule
Emp. Form.C21H25ClN6O
Mol. Mass.412.916
SMILESCN1CCN(CC1)c1nc(C)nc2n([C@@H]3CCOC3)c(nc12)-c1ccccc1Cl