Reaction Details
TargetCannabinoid receptor 2
LigandBDBM50387887
Substrate/Competitorn/a
Meas. Tech.ChEMBL_828930 (CHEMBL2060580)
EC50 4.6±n/a nM
Citation Hollinshead, SPAstles, PCChambers, MGJohnson, MPPalmer, JTidwell, MW Discovery and optimization of novel purines as potent and selective CB2 agonists. Bioorg Med Chem Lett22:4962-6 (2012) 
 
Cannabinoid receptor 2
Name:Cannabinoid receptor 2
Type:G Protein-Coupled Receptor (GPCR)
Mol. Mass.:39690.94
Organism:Homo sapiens (Human)
Description:P34972
Residue:360
BDBM50387887
NameBDBM50387887
Synonyms:CHEMBL2057798
TypeSmall organic molecule
Emp. Form.C19H23ClN6
Mol. Mass.370.879
SMILESCCN1CCN(CC1)c1nc(C)nc2n(C)c(nc12)-c1ccccc1Cl