Reaction Details
TargetPoly [ADP-ribose] polymerase 1
LigandBDBM50387916
Substrate/Competitorn/a
Meas. Tech.ChEMBL_830731 (CHEMBL2061718)
Ki 1.4±n/a nM
Citation Zhu, GDGong, JGandhi, VBLiu, XShi, YJohnson, EFDonawho, CKEllis, PABouska, JJOsterling, DJOlson, AMPark, CLuo, YShoemaker, AGiranda, VLPenning, TD Discovery and SAR of orally efficacious tetrahydropyridopyridazinone PARP inhibitors for the treatment of cancer. Bioorg Med Chem20:4635-45 (2012) 
 
Poly [ADP-ribose] polymerase 1
Name:Poly [ADP-ribose] polymerase 1
Type:n/a
Mol. Mass.:113114.22
Organism:Homo sapiens (Human)
Description:P09874
Residue:1014
BDBM50387916
NameBDBM50387916
Synonyms:CHEMBL2058681
TypeSmall organic molecule
Emp. Form.C18H17FN4O3
Mol. Mass.356.351
SMILESOc1ccc(O)n1-c1cc(Cc2n[nH]c(=O)c3CCCNc23)ccc1F