Reaction Details
TargetPoly [ADP-ribose] polymerase 1
LigandBDBM50387923
Substrate/Competitorn/a
Meas. Tech.ChEMBL_830731 (CHEMBL2061718)
Ki 4±n/a nM
Citation Zhu, GDGong, JGandhi, VBLiu, XShi, YJohnson, EFDonawho, CKEllis, PABouska, JJOsterling, DJOlson, AMPark, CLuo, YShoemaker, AGiranda, VLPenning, TD Discovery and SAR of orally efficacious tetrahydropyridopyridazinone PARP inhibitors for the treatment of cancer. Bioorg Med Chem20:4635-45 (2012) 
 
Poly [ADP-ribose] polymerase 1
Name:Poly [ADP-ribose] polymerase 1
Type:n/a
Mol. Mass.:113114.22
Organism:Homo sapiens (Human)
Description:P09874
Residue:1014
BDBM50387923
NameBDBM50387923
Synonyms:CHEMBL2058686 | US9283222, 477
TypeSmall organic molecule
Emp. Form.C20H23FN4O3
Mol. Mass.386.42
SMILESCC(=O)CCCC(=O)Nc1cc(Cc2n[nH]c(=O)c3CCCNc23)ccc1F