Reaction Details
TargetPoly [ADP-ribose] polymerase 1
LigandBDBM50387926
Substrate/Competitorn/a
Meas. Tech.ChEMBL_830731 (CHEMBL2061718)
Ki 17±n/a nM
Citation Zhu, GDGong, JGandhi, VBLiu, XShi, YJohnson, EFDonawho, CKEllis, PABouska, JJOsterling, DJOlson, AMPark, CLuo, YShoemaker, AGiranda, VLPenning, TD Discovery and SAR of orally efficacious tetrahydropyridopyridazinone PARP inhibitors for the treatment of cancer. Bioorg Med Chem20:4635-45 (2012) 
 
Poly [ADP-ribose] polymerase 1
Name:Poly [ADP-ribose] polymerase 1
Type:n/a
Mol. Mass.:113114.22
Organism:Homo sapiens (Human)
Description:P09874
Residue:1014
BDBM50387926
NameBDBM50387926
Synonyms:CHEMBL2058689
TypeSmall organic molecule
Emp. Form.C15H15FN4O2
Mol. Mass.302.3036
SMILESNC(=O)c1cc(Cc2n[nH]c(=O)c3CCCNc23)ccc1F