Reaction Details
TargetPoly [ADP-ribose] polymerase 1
LigandBDBM50387925
Substrate/Competitorn/a
Meas. Tech.ChEMBL_830732 (CHEMBL2061719)
EC50 16±n/a nM
Citation Zhu, GDGong, JGandhi, VBLiu, XShi, YJohnson, EFDonawho, CKEllis, PABouska, JJOsterling, DJOlson, AMPark, CLuo, YShoemaker, AGiranda, VLPenning, TD Discovery and SAR of orally efficacious tetrahydropyridopyridazinone PARP inhibitors for the treatment of cancer. Bioorg Med Chem20:4635-45 (2012) 
 
Poly [ADP-ribose] polymerase 1
Name:Poly [ADP-ribose] polymerase 1
Type:n/a
Mol. Mass.:113114.22
Organism:Homo sapiens (Human)
Description:P09874
Residue:1014
BDBM50387925
NameBDBM50387925
Synonyms:CHEMBL2058688 | US9283222, 479
TypeSmall organic molecule
Emp. Form.C24H23FN4O3
Mol. Mass.434.4628
SMILESFc1ccc(Cc2n[nH]c(=O)c3CCCNc23)cc1NC(=O)CCC(=O)c1ccccc1