Reaction Details
TargetPoly [ADP-ribose] polymerase 1
LigandBDBM50387946
Substrate/Competitorn/a
Meas. Tech.ChEMBL_830732 (CHEMBL2061719)
EC50 1±n/a nM
Citation Zhu, GDGong, JGandhi, VBLiu, XShi, YJohnson, EFDonawho, CKEllis, PABouska, JJOsterling, DJOlson, AMPark, CLuo, YShoemaker, AGiranda, VLPenning, TD Discovery and SAR of orally efficacious tetrahydropyridopyridazinone PARP inhibitors for the treatment of cancer. Bioorg Med Chem20:4635-45 (2012) 
 
Poly [ADP-ribose] polymerase 1
Name:Poly [ADP-ribose] polymerase 1
Type:n/a
Mol. Mass.:113114.22
Organism:Homo sapiens (Human)
Description:P09874
Residue:1014
BDBM50387946
NameBDBM50387946
Synonyms:CHEMBL2058928 | US9283222, 536
TypeSmall organic molecule
Emp. Form.C23H24FN7O2
Mol. Mass.449.4808
SMILESFc1ccc(Cc2n[nH]c(=O)c3CCCNc23)cc1C(=O)N1CCN(CC1)c1ncccn1