Reaction Details
TargetHistamine N-methyltransferase
LigandBDBM50041457
Substrate/Competitorn/a
Meas. Tech.ChEMBL_829172 (CHEMBL2059994)
Ki 19±n/a nM
Citation Lee, SGAlpert, TDJez, JM Crystal structure of phosphoethanolamine methyltransferase from Plasmodium falciparum in complex with amodiaquine. Bioorg Med Chem Lett22:4990-3 (2012) 
 
Histamine N-methyltransferase
Name:Histamine N-methyltransferase
Type:PROTEIN
Mol. Mass.:33287.63
Organism:Homo sapiens (Human)
Description:ChEMBL_87234
Residue:292
BDBM50041457
NameBDBM50041457
Synonyms:4-[(7-chloroquinolin-4-yl)amino]-2-[(diethylamino)methyl]phenol CHEMBL682 | med.21724, Compound 188
TypeSmall organic molecule
Emp. Form.C20H22ClN3O
Mol. Mass.355.861
SMILESCCN(CC)Cc1cc(Nc2ccnc3cc(Cl)ccc23)ccc1O