Reaction Details
TargetAmine oxidase [flavin-containing] B
LigandBDBM50388009
Substrate/Competitorn/a
Meas. Tech.ChEMBL_829594 (CHEMBL2060937)
IC50 9017±n/a nM
Citation Lewellyn, KBialonska, DChaurasiya, NDTekwani, BLZjawiony, JK Synthesis and evaluation of aplysinopsin analogs as inhibitors of human monoamine oxidase A and B. Bioorg Med Chem Lett22:4926-9 (2012) 
 
Amine oxidase [flavin-containing] B
Name:Amine oxidase [flavin-containing] B
Type:Protein
Mol. Mass.:58768.76
Organism:Homo sapiens (Human)
Description:P27338
Residue:520
BDBM50388009
NameBDBM50388009
Synonyms:METHYLAPLYSINOPSIN
TypeSmall organic molecule
Emp. Form.C15H16N4O
Mol. Mass.268.3137
SMILESC\N=C1/N(C)C(=O)\C(=C/c2c[nH]c3ccccc23)N1C