Reaction Details
TargetAmine oxidase [flavin-containing] A
LigandBDBM50387993
Substrate/Competitorn/a
Meas. Tech.ChEMBL_829593 (CHEMBL2060936)
IC50 677±n/a nM
Citation Lewellyn, KBialonska, DChaurasiya, NDTekwani, BLZjawiony, JK Synthesis and evaluation of aplysinopsin analogs as inhibitors of human monoamine oxidase A and B. Bioorg Med Chem Lett22:4926-9 (2012) 
 
Amine oxidase [flavin-containing] A
Name:Amine oxidase [flavin-containing] A
Type:Protein
Mol. Mass.:59689.53
Organism:Homo sapiens (Human)
Description:P21397
Residue:527
BDBM50387993
NameBDBM50387993
Synonyms:CHEMBL2058698
TypeSmall organic molecule
Emp. Form.C13H10BrN3OS
Mol. Mass.336.207
SMILESCSC1=NC(=O)C(N1)=Cc1c[nH]c2cccc(Br)c12