Reaction Details
TargetAmine oxidase [flavin-containing] A
LigandBDBM50388020
Substrate/Competitorn/a
Meas. Tech.ChEMBL_829593 (CHEMBL2060936)
IC50 1197±n/a nM
Citation Lewellyn, KBialonska, DChaurasiya, NDTekwani, BLZjawiony, JK Synthesis and evaluation of aplysinopsin analogs as inhibitors of human monoamine oxidase A and B. Bioorg Med Chem Lett22:4926-9 (2012) 
 
Amine oxidase [flavin-containing] A
Name:Amine oxidase [flavin-containing] A
Type:Protein
Mol. Mass.:59689.53
Organism:Homo sapiens (Human)
Description:P21397
Residue:527
BDBM50388020
NameBDBM50388020
Synonyms:CHEMBL2058414
TypeSmall organic molecule
Emp. Form.C13H11BrN4O
Mol. Mass.319.157
SMILESCN1C(N)=NC(=Cc2c[nH]c3c(Br)cccc23)C1=O