Reaction Details
TargetPotassium voltage-gated channel subfamily H member 2
LigandBDBM50388102
Substrate/Competitorn/a
Meas. Tech.ChEMBL_829335 (CHEMBL2060325)
IC50>30000±n/a nM
Citation Martínez González, SHernández, AIVarela, CLorenzo, MRamos-Lima, FCendón, ECebrián, DAguirre, EGomez-Casero, EAlbarrán, MIAlfonso, PGarcía-Serelde, BMateos, GOyarzabal, JRabal, OMulero, FGonzalez-Granda, TLink, WFominaya, JBarbacid, MBischoff, JRPizcueta, PBlanco-Aparicio, CPastor, J Rapid identification of ETP-46992, orally bioavailable PI3K inhibitor, selective versus mTOR. Bioorg Med Chem Lett22:5208-14 (2012) 
 
Potassium voltage-gated channel subfamily H member 2
Name:Potassium voltage-gated channel subfamily H member 2
Type:Multi-pass membrane protein
Mol. Mass.:126672.65
Organism:Homo sapiens (Human)
Description:Q12809
Residue:1159
BDBM50388102
NameBDBM50388102
Synonyms:CHEMBL2058172
TypeSmall organic molecule
Emp. Form.C19H24N8O3
Mol. Mass.412.4457
SMILESCOCCNC(=O)c1nc2c(nc(cn2c1C)-c1cnc(N)nc1)N1CCOCC1