Reaction Details
TargetPhosphatidylinositol 4,5-bisphosphate 3-kinase catalytic subunit alpha isoform
LigandBDBM50365514
Substrate/Competitorn/a
Meas. Tech.ChEMBL_829329 (CHEMBL2060319)
IC50 429±n/a nM
Citation Martínez González, SHernández, AIVarela, CLorenzo, MRamos-Lima, FCendón, ECebrián, DAguirre, EGomez-Casero, EAlbarrán, MIAlfonso, PGarcía-Serelde, BMateos, GOyarzabal, JRabal, OMulero, FGonzalez-Granda, TLink, WFominaya, JBarbacid, MBischoff, JRPizcueta, PBlanco-Aparicio, CPastor, J Rapid identification of ETP-46992, orally bioavailable PI3K inhibitor, selective versus mTOR. Bioorg Med Chem Lett22:5208-14 (2012) 
 
Phosphatidylinositol 4,5-bisphosphate 3-kinase catalytic subunit alpha isoform
Name:Phosphatidylinositol 4,5-bisphosphate 3-kinase catalytic subunit alpha isoform
Type:Enzyme Subunit
Mol. Mass.:124294.87
Organism:Homo sapiens (Human)
Description:P42336
Residue:1068
BDBM50365514
NameBDBM50365514
Synonyms:CHEMBL1957505
TypeSmall organic molecule
Emp. Form.C23H28N8O2
Mol. Mass.448.5208
SMILESCN(C)CCCNC(=O)c1cn2cc(nc(N3CCOCC3)c2n1)-c1cccc2[nH]ncc12