Reaction Details
TargetSerine/threonine-protein kinase mTOR
LigandBDBM50388106
Substrate/Competitorn/a
Meas. Tech.ChEMBL_829330 (CHEMBL2060320)
IC50 989±n/a nM
Citation Martínez González, SHernández, AIVarela, CLorenzo, MRamos-Lima, FCendón, ECebrián, DAguirre, EGomez-Casero, EAlbarrán, MIAlfonso, PGarcía-Serelde, BMateos, GOyarzabal, JRabal, OMulero, FGonzalez-Granda, TLink, WFominaya, JBarbacid, MBischoff, JRPizcueta, PBlanco-Aparicio, CPastor, J Rapid identification of ETP-46992, orally bioavailable PI3K inhibitor, selective versus mTOR. Bioorg Med Chem Lett22:5208-14 (2012) 
 
Serine/threonine-protein kinase mTOR
Name:Serine/threonine-protein kinase mTOR
Type:Rapamycin target protein
Mol. Mass.:288917.12
Organism:Homo sapiens (Human)
Description:P42345
Residue:2549
BDBM50388106
NameBDBM50388106
Synonyms:CHEMBL2058168
TypeSmall organic molecule
Emp. Form.C21H26N8O3
Mol. Mass.438.4829
SMILESNc1ncc(cn1)-c1cn2cc(nc2c(n1)N1CCOCC1)C(=O)N[C@H]1CC[C@H](O)CC1