Reaction Details
TargetSerine/threonine-protein kinase mTOR
LigandBDBM50388107
Substrate/Competitorn/a
Meas. Tech.ChEMBL_829330 (CHEMBL2060320)
IC50>5000±n/a nM
Citation Martínez González, SHernández, AIVarela, CLorenzo, MRamos-Lima, FCendón, ECebrián, DAguirre, EGomez-Casero, EAlbarrán, MIAlfonso, PGarcía-Serelde, BMateos, GOyarzabal, JRabal, OMulero, FGonzalez-Granda, TLink, WFominaya, JBarbacid, MBischoff, JRPizcueta, PBlanco-Aparicio, CPastor, J Rapid identification of ETP-46992, orally bioavailable PI3K inhibitor, selective versus mTOR. Bioorg Med Chem Lett22:5208-14 (2012) 
 
Serine/threonine-protein kinase mTOR
Name:Serine/threonine-protein kinase mTOR
Type:Rapamycin target protein
Mol. Mass.:288917.12
Organism:Homo sapiens (Human)
Description:P42345
Residue:2549
BDBM50388107
NameBDBM50388107
Synonyms:CHEMBL2058167
TypeSmall organic molecule
Emp. Form.C19H24N8O3
Mol. Mass.412.4457
SMILESCOCCCNC(=O)c1cn2cc(nc(N3CCOCC3)c2n1)-c1cnc(N)nc1