Reaction Details
TargetEndochitinase A1
LigandBDBM81508
Substrate/Competitorn/a
Meas. Tech.ChEMBL_828637 (CHEMBL2060194)
IC50>1000000±n/a nM
Citation Schüttelkopf, AWAndersen, OARao, FVAllwood, MRush, CLEggleston, IMvan Aalten, DM Bisdionin C-a rationally designed, submicromolar inhibitor of family 18 chitinases. ACS Med Chem Lett2:428-432 (2011) 
 
Endochitinase A1
Name:Endochitinase A1
Type:Enzyme
Mol. Mass.:83057.83
Organism:Neosartorya fumigata (Aspergillus fumigatus)
Description:Q873Y0
Residue:825
BDBM81508
NameBDBM81508
Synonyms:Bisdionin C
TypeSmall organic molecule
Emp. Form.C17H20N8O4
Mol. Mass.400.3919
SMILESCn1cnc2n(C)c(=O)n(CCCn3c(=O)n(C)c4ncn(C)c4c3=O)c(=O)c12