Reaction Details
TargetEukaryotic initiation factor 4A-I
LigandBDBM50388144
Substrate/Competitorn/a
Meas. Tech.ChEMBL_828665 (CHEMBL2060259)
IC50 20±n/a nM
Citation Rodrigo, CMCencic, RRoche, SPPelletier, JPorco, JA Synthesis of rocaglamide hydroxamates and related compounds as eukaryotic translation inhibitors: synthetic and biological studies. J Med Chem55:558-62 (2012) 
 
Eukaryotic initiation factor 4A-I
Name:Eukaryotic initiation factor 4A-I
Type:PROTEIN
Mol. Mass.:46146.87
Organism:Homo sapiens (Human)
Description:ChEMBL_864983
Residue:406
BDBM50388144
NameBDBM50388144
Synonyms:CHEMBL2058177
TypeSmall organic molecule
Emp. Form.C28H29NO8
Mol. Mass.507.5318
SMILESCONC(=O)[C@H]1[C@@H](O)[C@@]2(O)c3c(O[C@]2([C@@H]1c1ccccc1)c1ccc(OC)cc1)cc(OC)cc3OC