Reaction Details
TargetMuscarinic acetylcholine receptor M1
LigandBDBM50388666
Substrate/Competitorn/a
Meas. Tech.ChEMBL_829274 (CHEMBL2060121)
EC50 68±n/a nM
Citation Sams, AGLarsen, KMikkelsen, GKHentzer, MChristoffersen, CTJensen, KGFrederiksen, KBang-Andersen, B Hit-to-lead investigation of a series of novel combined dopamine D2 and muscarinic M1 receptor ligands with putative antipsychotic and pro-cognitive potential. Bioorg Med Chem Lett22:5134-40 (2012) 
 
Muscarinic acetylcholine receptor M1
Name:Muscarinic acetylcholine receptor M1
Type:Protein
Mol. Mass.:51442.54
Organism:Homo sapiens (Human)
Description:P11229
Residue:460
BDBM50388666
NameBDBM50388666
Synonyms:CHEMBL2059317
TypeSmall organic molecule
Emp. Form.C24H27FN4O2
Mol. Mass.422.4952
SMILESFc1cccc2N(CCCN3CCC(CC3)n3c4ccccc4[nH]c3=O)C(=O)CCc12