Reaction Details
Target5-hydroxytryptamine receptor 4
LigandBDBM50240618
Substrate/Competitorn/a
Meas. Tech.ChEMBL_829296 (CHEMBL2060286)
Ki 3.98±n/a nM
Citation Long, DDArmstrong, SRBeattie, DTChoi, SKFatheree, PRGendron, RAGoldblum, AAHumphrey, PPMarquess, DGShaw, JPSmith, JADerek Turner, SVickery, RG Discovery, oral pharmacokinetics and in vivo efficacy of a highly selective 5-HT4 receptor agonist: clinical compound TD-2749. Bioorg Med Chem Lett22:4849-53 (2012) 
 
5-hydroxytryptamine receptor 4
Name:5-hydroxytryptamine receptor 4
Type:Enzyme
Mol. Mass.:43767.54
Organism:Homo sapiens (Human)
Description:Q13639
Residue:388
BDBM50240618
NameBDBM50240618
Synonyms:(2E)-2-[(5-methoxy-1H-indol-3-yl)methylene]-N-pentylhydrazinecarboximidamide TEGASEROD
TypeSmall organic molecule
Emp. Form.C16H23N5O
Mol. Mass.301.3867
SMILESCCCCCNC(N)=NN=Cc1c[nH]c2ccc(OC)cc12