Reaction Details
TargetTyrosine-protein phosphatase non-receptor type 1
LigandBDBM50388723
Substrate/Competitorn/a
Meas. Tech.ChEMBL_829770 (CHEMBL2061289)
IC50>100000±n/a nM
Citation Mak, LHKnott, JScott, KAScott, CWhyte, GFYe, YMann, DJCes, OStivers, JWoscholski, R Arylstibonic acids are potent and isoform-selective inhibitors of Cdc25a and Cdc25b phosphatases. Bioorg Med Chem20:4371-6 (2012) 
 
Tyrosine-protein phosphatase non-receptor type 1
Name:Tyrosine-protein phosphatase non-receptor type 1
Type:Protein phosphatase
Mol. Mass.:49963.76
Organism:Homo sapiens (Human)
Description:Human recombinant GST-fusion PTP1B (1-435).
Residue:435
BDBM50388723
NameBDBM50388723
Synonyms:CHEMBL2057662
TypeSmall organic molecule
Emp. Form.C9H11O5Sb
Mol. Mass.320.94
SMILESOC(=O)CCc1cccc(c1)[Sb](O)(O)=O